,,,,,COVID-19 recovering individual,COVID-19 recovering individual,COVID-19 recovering individual,COVID-19 recovering individual,COVID-19 recovering individual,COVID-19 recovering individual,COVID-19 recovering individual,COVID-19 recovering individual,COVID-19 recovering individual,COVID-19 recovering individual,COVID-19 recovering individual,COVID-19 recovering individual,COVID-19 recovering individual,COVID-19 recovering individual,COVID-19 recovering individual,COVID-19 recovering individual,COVID-19 recovering individual,COVID-19 recovering individual,COVID-19 recovering individual,COVID-19 recovering individual,COVID-19 recovering individual,COVID-19 recovering individual,COVID-19 recovering individual,COVID-19 recovering individual,COVID-19 recovering individual,COVID-19 recovering individual,COVID-19 recovering individual,COVID-19 recovering individual,COVID-19 recovering individual,COVID-19 recovering individual,COVID-19 recovering individual,COVID-19 recovering individual,COVID-19 recovering individual,COVID-19 recovering individual,COVID-19 recovering individual,COVID-19 recovering individual,COVID-19 recovering individual,COVID-19 recovering individual,COVID-19 recovering individual,COVID-19 recovering individual,COVID-19 recovering individual,COVID-19 recovering individual,COVID-19 recovering individual,COVID-19 recovering individual,COVID-19 recovering individual,COVID-19 recovering individual,COVID-19 recovering individual,COVID-19 recovering individual,COVID-19 recovering individual,COVID-19 recovering individual,COVID-19 recovering individual,COVID-19 recovering individual,COVID-19 recovering individual,COVID-19 recovering individual,COVID-19 recovering individual,COVID-19 recovering individual,COVID-19 recovering individual,COVID-19 recovering individual,COVID-19 recovering individual,COVID-19 recovering individual,COVID-19 recovering individual,COVID-19 recovering individual,COVID-19 recovering individual,COVID-19 recovering individual,COVID-19 recovering individual,COVID-19 recovering individual,COVID-19 recovering individual,COVID-19 recovering individual,COVID-19 recovering individual,COVID-19 recovering individual,COVID-19 recovering individual,COVID-19 recovering individual,COVID-19 recovering individual,COVID-19 recovering individual,COVID-19 recovering individual,COVID-19 recovering individual,COVID-19 recovering individual,COVID-19 recovering individual,COVID-19 recovering individual,COVID-19 recovering individual,COVID-19 recovering individual,COVID-19 recovering individual,COVID-19 recovering individual,COVID-19 recovering individual,COVID-19 recovering individual,COVID-19 recovering individual,COVID-19 recovering individual,COVID-19 recovering individual,Healthy individual,Healthy individual,Healthy individual,Healthy individual,Healthy individual,Healthy individual,Healthy individual,Healthy individual,Healthy individual,Healthy individual,Healthy individual,Healthy individual,Healthy individual,Healthy individual,Healthy individual,Healthy individual,Healthy individual,Healthy individual,Healthy individual,Healthy individual,Healthy individual,Healthy individual,Healthy individual,Healthy individual,Healthy individual,Healthy individual,COVID-19 recovering individual,COVID-19 recovering individual,COVID-19 recovering individual,COVID-19 recovering individual,COVID-19 recovering individual,COVID-19 recovering individual,COVID-19 recovering individual,COVID-19 recovering individual,COVID-19 recovering individual,COVID-19 recovering individual,COVID-19 recovering individual,COVID-19 recovering individual,COVID-19 recovering individual,COVID-19 recovering individual,COVID-19 recovering individual,COVID-19 recovering individual,COVID-19 recovering individual,COVID-19 recovering individual,COVID-19 recovering individual,COVID-19 recovering individual,COVID-19 recovering individual,COVID-19 recovering individual,COVID-19 recovering individual,COVID-19 recovering individual,COVID-19 recovering individual,COVID-19 recovering individual,COVID-19 recovering individual,COVID-19 recovering individual,COVID-19 recovering individual,COVID-19 recovering individual,COVID-19 recovering individual,COVID-19 recovering individual,COVID-19 recovering individual,COVID-19 recovering individual,COVID-19 recovering individual,COVID-19 recovering individual,COVID-19 recovering individual,COVID-19 recovering individual,COVID-19 recovering individual,COVID-19 recovering individual,COVID-19 recovering individual,COVID-19 recovering individual,COVID-19 recovering individual,COVID-19 recovering individual,COVID-19 recovering individual,COVID-19 recovering individual,COVID-19 recovering individual,COVID-19 recovering individual,COVID-19 recovering individual,COVID-19 recovering individual,COVID-19 recovering individual,COVID-19 recovering individual,COVID-19 recovering individual,COVID-19 recovering individual,COVID-19 recovering individual,COVID-19 recovering individual,COVID-19 recovering individual,COVID-19 recovering individual,COVID-19 recovering individual,COVID-19 recovering individual,COVID-19 recovering individual,COVID-19 recovering individual,COVID-19 recovering individual,COVID-19 recovering individual,COVID-19 recovering individual,COVID-19 recovering individual,COVID-19 recovering individual,COVID-19 recovering individual,COVID-19 recovering individual,COVID-19 recovering individual,COVID-19 recovering individual,COVID-19 recovering individual,COVID-19 recovering individual,COVID-19 recovering individual,COVID-19 recovering individual,COVID-19 recovering individual,COVID-19 recovering individual,COVID-19 recovering individual,COVID-19 recovering individual,COVID-19 recovering individual,COVID-19 recovering individual,COVID-19 recovering individual,COVID-19 recovering individual,COVID-19 recovering individual,COVID-19 recovering individual,COVID-19 recovering individual,COVID-19 recovering individual,COVID-19 recovering individual,Healthy individual,Healthy individual,Healthy individual,Healthy individual,Healthy individual,Healthy individual,Healthy individual,Healthy individual,Healthy individual,Healthy individual,Healthy individual,Healthy individual,Healthy individual,Healthy individual,Healthy individual,Healthy individual,Healthy individual,Healthy individual,Healthy individual,Healthy individual,Healthy individual,Healthy individual,Healthy individual,Healthy individual,Healthy individual,Healthy individual,COVID-19 recovering individual,COVID-19 recovering individual,COVID-19 recovering individual,COVID-19 recovering individual,COVID-19 recovering individual,COVID-19 recovering individual,COVID-19 recovering individual,COVID-19 recovering individual,COVID-19 recovering individual,COVID-19 recovering individual,COVID-19 recovering individual,COVID-19 recovering individual,COVID-19 recovering individual,COVID-19 recovering individual,COVID-19 recovering individual,COVID-19 recovering individual,COVID-19 recovering individual,COVID-19 recovering individual,COVID-19 recovering individual,COVID-19 recovering individual,COVID-19 recovering individual,COVID-19 recovering individual,COVID-19 recovering individual,COVID-19 recovering individual,COVID-19 recovering individual,COVID-19 recovering individual,COVID-19 recovering individual,COVID-19 recovering individual,COVID-19 recovering individual,COVID-19 recovering individual,COVID-19 recovering individual,COVID-19 recovering individual,COVID-19 recovering individual,COVID-19 recovering individual,COVID-19 recovering individual,COVID-19 recovering individual,COVID-19 recovering individual,COVID-19 recovering individual,COVID-19 recovering individual,COVID-19 recovering individual,COVID-19 recovering individual,COVID-19 recovering individual,COVID-19 recovering individual,COVID-19 recovering individual,COVID-19 recovering individual,COVID-19 recovering individual,COVID-19 recovering individual,COVID-19 recovering individual,COVID-19 recovering individual,COVID-19 recovering individual,COVID-19 recovering individual,COVID-19 recovering individual,COVID-19 recovering individual,COVID-19 recovering individual,COVID-19 recovering individual,COVID-19 recovering individual,COVID-19 recovering individual,COVID-19 recovering individual,COVID-19 recovering individual,COVID-19 recovering individual,COVID-19 recovering individual,COVID-19 recovering individual,COVID-19 recovering individual,COVID-19 recovering individual,COVID-19 recovering individual,COVID-19 recovering individual,COVID-19 recovering individual,COVID-19 recovering individual,COVID-19 recovering individual,COVID-19 recovering individual,COVID-19 recovering individual,COVID-19 recovering individual,COVID-19 recovering individual,COVID-19 recovering individual,COVID-19 recovering individual,COVID-19 recovering individual,COVID-19 recovering individual,COVID-19 recovering individual,COVID-19 recovering individual,COVID-19 recovering individual,COVID-19 recovering individual,COVID-19 recovering individual,COVID-19 recovering individual,COVID-19 recovering individual,COVID-19 recovering individual,COVID-19 recovering individual,COVID-19 recovering individual,COVID-19 recovering individual,Healthy individual,Healthy individual,Healthy individual,Healthy individual,Healthy individual,Healthy individual,Healthy individual,Healthy individual,Healthy individual,Healthy individual,Healthy individual,Healthy individual,Healthy individual,Healthy individual,Healthy individual,Healthy individual,Healthy individual,Healthy individual,Healthy individual,Healthy individual,Healthy individual,Healthy individual,Healthy individual,Healthy individual,Healthy individual,Healthy individual
,,,,,1,2,3,4,5,6,7,8,9,10,11,12,13,14,15,16,17,18,19,20,21,22,23,24,25,26,27,28,29,30,31,32,33,34,35,36,37,38,39,40,41,42,43,44,45,46,47,48,49,50,51,52,53,54,55,56,57,58,59,60,61,62,63,64,65,66,67,68,69,70,71,72,73,74,75,76,77,78,79,80,81,82,83,84,85,86,87,88,1,2,3,4,5,6,7,8,9,10,11,12,13,14,15,16,17,18,19,20,21,22,23,24,25,26,1,2,3,4,5,6,7,8,9,10,11,12,13,14,15,16,17,18,19,20,21,22,23,24,25,26,27,28,29,30,31,32,33,34,35,36,37,38,39,40,41,42,43,44,45,46,47,48,49,50,51,52,53,54,55,56,57,58,59,60,61,62,63,64,65,66,67,68,69,70,71,72,73,74,75,76,77,78,79,80,81,82,83,84,85,86,87,88,1,2,3,4,5,6,7,8,9,10,11,12,13,14,15,16,17,18,19,20,21,22,23,24,25,26,1,2,3,4,5,6,7,8,9,10,11,12,13,14,15,16,17,18,19,20,21,22,23,24,25,26,27,28,29,30,31,32,33,34,35,36,37,38,39,40,41,42,43,44,45,46,47,48,49,50,51,52,53,54,55,56,57,58,59,60,61,62,63,64,65,66,67,68,69,70,71,72,73,74,75,76,77,78,79,80,81,82,83,84,85,86,87,88,1,2,3,4,5,6,7,8,9,10,11,12,13,14,15,16,17,18,19,20,21,22,23,24,25,26
,,,,,IgG,IgG,IgG,IgG,IgG,IgG,IgG,IgG,IgG,IgG,IgG,IgG,IgG,IgG,IgG,IgG,IgG,IgG,IgG,IgG,IgG,IgG,IgG,IgG,IgG,IgG,IgG,IgG,IgG,IgG,IgG,IgG,IgG,IgG,IgG,IgG,IgG,IgG,IgG,IgG,IgG,IgG,IgG,IgG,IgG,IgG,IgG,IgG,IgG,IgG,IgG,IgG,IgG,IgG,IgG,IgG,IgG,IgG,IgG,IgG,IgG,IgG,IgG,IgG,IgG,IgG,IgG,IgG,IgG,IgG,IgG,IgG,IgG,IgG,IgG,IgG,IgG,IgG,IgG,IgG,IgG,IgG,IgG,IgG,IgG,IgG,IgG,IgG,IgG,IgG,IgG,IgG,IgG,IgG,IgG,IgG,IgG,IgG,IgG,IgG,IgG,IgG,IgG,IgG,IgG,IgG,IgG,IgG,IgG,IgG,IgG,IgG,IgG,IgG,IgM,IgM,IgM,IgM,IgM,IgM,IgM,IgM,IgM,IgM,IgM,IgM,IgM,IgM,IgM,IgM,IgM,IgM,IgM,IgM,IgM,IgM,IgM,IgM,IgM,IgM,IgM,IgM,IgM,IgM,IgM,IgM,IgM,IgM,IgM,IgM,IgM,IgM,IgM,IgM,IgM,IgM,IgM,IgM,IgM,IgM,IgM,IgM,IgM,IgM,IgM,IgM,IgM,IgM,IgM,IgM,IgM,IgM,IgM,IgM,IgM,IgM,IgM,IgM,IgM,IgM,IgM,IgM,IgM,IgM,IgM,IgM,IgM,IgM,IgM,IgM,IgM,IgM,IgM,IgM,IgM,IgM,IgM,IgM,IgM,IgM,IgM,IgM,IgM,IgM,IgM,IgM,IgM,IgM,IgM,IgM,IgM,IgM,IgM,IgM,IgM,IgM,IgM,IgM,IgM,IgM,IgM,IgM,IgM,IgM,IgM,IgM,IgM,IgM,IgA,IgA,IgA,IgA,IgA,IgA,IgA,IgA,IgA,IgA,IgA,IgA,IgA,IgA,IgA,IgA,IgA,IgA,IgA,IgA,IgA,IgA,IgA,IgA,IgA,IgA,IgA,IgA,IgA,IgA,IgA,IgA,IgA,IgA,IgA,IgA,IgA,IgA,IgA,IgA,IgA,IgA,IgA,IgA,IgA,IgA,IgA,IgA,IgA,IgA,IgA,IgA,IgA,IgA,IgA,IgA,IgA,IgA,IgA,IgA,IgA,IgA,IgA,IgA,IgA,IgA,IgA,IgA,IgA,IgA,IgA,IgA,IgA,IgA,IgA,IgA,IgA,IgA,IgA,IgA,IgA,IgA,IgA,IgA,IgA,IgA,IgA,IgA,IgA,IgA,IgA,IgA,IgA,IgA,IgA,IgA,IgA,IgA,IgA,IgA,IgA,IgA,IgA,IgA,IgA,IgA,IgA,IgA,IgA,IgA,IgA,IgA,IgA,IgA
#,Sample type,Category,Species,Antigen,COVID-19_1_IgG,COVID-19_2_IgG,COVID-19_3_IgG,COVID-19_4_IgG,COVID-19_5_IgG,COVID-19_6_IgG,COVID-19_7_IgG,COVID-19_8_IgG,COVID-19_9_IgG,COVID-19_10_IgG,COVID-19_11_IgG,COVID-19_12_IgG,COVID-19_13_IgG,COVID-19_14_IgG,COVID-19_15_IgG,COVID-19_16_IgG,COVID-19_17_IgG,COVID-19_18_IgG,COVID-19_19_IgG,COVID-19_20_IgG,COVID-19_21_IgG,COVID-19_22_IgG,COVID-19_23_IgG,COVID-19_24_IgG,COVID-19_25_IgG,COVID-19_26_IgG,COVID-19_27_IgG,COVID-19_28_IgG,COVID-19_29_IgG,COVID-19_30_IgG,COVID-19_31_IgG,COVID-19_32_IgG,COVID-19_33_IgG,COVID-19_34_IgG,COVID-19_35_IgG,COVID-19_36_IgG,COVID-19_37_IgG,COVID-19_38_IgG,COVID-19_39_IgG,COVID-19_40_IgG,COVID-19_41_IgG,COVID-19_42_IgG,COVID-19_43_IgG,COVID-19_44_IgG,COVID-19_45_IgG,COVID-19_46_IgG,COVID-19_47_IgG,COVID-19_48_IgG,COVID-19_49_IgG,COVID-19_50_IgG,COVID-19_51_IgG,COVID-19_52_IgG,COVID-19_53_IgG,COVID-19_54_IgG,COVID-19_55_IgG,COVID-19_56_IgG,COVID-19_57_IgG,COVID-19_58_IgG,COVID-19_59_IgG,COVID-19_60_IgG,COVID-19_61_IgG,COVID-19_62_IgG,COVID-19_63_IgG,COVID-19_64_IgG,COVID-19_65_IgG,COVID-19_66_IgG,COVID-19_67_IgG,COVID-19_68_IgG,COVID-19_69_IgG,COVID-19_70_IgG,COVID-19_71_IgG,COVID-19_72_IgG,COVID-19_73_IgG,COVID-19_74_IgG,COVID-19_75_IgG,COVID-19_76_IgG,COVID-19_77_IgG,COVID-19_78_IgG,COVID-19_79_IgG,COVID-19_80_IgG,COVID-19_81_IgG,COVID-19_82_IgG,COVID-19_83_IgG,COVID-19_84_IgG,COVID-19_85_IgG,COVID-19_86_IgG,COVID-19_87_IgG,COVID-19_88_IgG,Normal_1_IgG,Normal_2_IgG,Normal_3_IgG,Normal_4_IgG,Normal_5_IgG,Normal_6_IgG,Normal_7_IgG,Normal_8_IgG,Normal_9_IgG,Normal_10_IgG,Normal_11_IgG,Normal_12_IgG,Normal_13_IgG,Normal_14_IgG,Normal_15_IgG,Normal_16_IgG,Normal_17_IgG,Normal_18_IgG,Normal_19_IgG,Normal_20_IgG,Normal_21_IgG,Normal_22_IgG,Normal_23_IgG,Normal_24_IgG,Normal_25_IgG,Normal_26_IgG,COVID-19_1_IgM,COVID-19_2_IgM,COVID-19_3_IgM,COVID-19_4_IgM,COVID-19_5_IgM,COVID-19_6_IgM,COVID-19_7_IgM,COVID-19_8_IgM,COVID-19_9_IgM,COVID-19_10_IgM,COVID-19_11_IgM,COVID-19_12_IgM,COVID-19_13_IgM,COVID-19_14_IgM,COVID-19_15_IgM,COVID-19_16_IgM,COVID-19_17_IgM,COVID-19_18_IgM,COVID-19_19_IgM,COVID-19_20_IgM,COVID-19_21_IgM,COVID-19_22_IgM,COVID-19_23_IgM,COVID-19_24_IgM,COVID-19_25_IgM,COVID-19_26_IgM,COVID-19_27_IgM,COVID-19_28_IgM,COVID-19_29_IgM,COVID-19_30_IgM,COVID-19_31_IgM,COVID-19_32_IgM,COVID-19_33_IgM,COVID-19_34_IgM,COVID-19_35_IgM,COVID-19_36_IgM,COVID-19_37_IgM,COVID-19_38_IgM,COVID-19_39_IgM,COVID-19_40_IgM,COVID-19_41_IgM,COVID-19_42_IgM,COVID-19_43_IgM,COVID-19_44_IgM,COVID-19_45_IgM,COVID-19_46_IgM,COVID-19_47_IgM,COVID-19_48_IgM,COVID-19_49_IgM,COVID-19_50_IgM,COVID-19_51_IgM,COVID-19_52_IgM,COVID-19_53_IgM,COVID-19_54_IgM,COVID-19_55_IgM,COVID-19_56_IgM,COVID-19_57_IgM,COVID-19_58_IgM,COVID-19_59_IgM,COVID-19_60_IgM,COVID-19_61_IgM,COVID-19_62_IgM,COVID-19_63_IgM,COVID-19_64_IgM,COVID-19_65_IgM,COVID-19_66_IgM,COVID-19_67_IgM,COVID-19_68_IgM,COVID-19_69_IgM,COVID-19_70_IgM,COVID-19_71_IgM,COVID-19_72_IgM,COVID-19_73_IgM,COVID-19_74_IgM,COVID-19_75_IgM,COVID-19_76_IgM,COVID-19_77_IgM,COVID-19_78_IgM,COVID-19_79_IgM,COVID-19_80_IgM,COVID-19_81_IgM,COVID-19_82_IgM,COVID-19_83_IgM,COVID-19_84_IgM,COVID-19_85_IgM,COVID-19_86_IgM,COVID-19_87_IgM,COVID-19_88_IgM,Normal_1_IgM,Normal_2_IgM,Normal_3_IgM,Normal_4_IgM,Normal_5_IgM,Normal_6_IgM,Normal_7_IgM,Normal_8_IgM,Normal_9_IgM,Normal_10_IgM,Normal_11_IgM,Normal_12_IgM,Normal_13_IgM,Normal_14_IgM,Normal_15_IgM,Normal_16_IgM,Normal_17_IgM,Normal_18_IgM,Normal_19_IgM,Normal_20_IgM,Normal_21_IgM,Normal_22_IgM,Normal_23_IgM,Normal_24_IgM,Normal_25_IgM,Normal_26_IgM,COVID-19_1_IgA,COVID-19_2_IgA,COVID-19_3_IgA,COVID-19_4_IgA,COVID-19_5_IgA,COVID-19_6_IgA,COVID-19_7_IgA,COVID-19_8_IgA,COVID-19_9_IgA,COVID-19_10_IgA,COVID-19_11_IgA,COVID-19_12_IgA,COVID-19_13_IgA,COVID-19_14_IgA,COVID-19_15_IgA,COVID-19_16_IgA,COVID-19_17_IgA,COVID-19_18_IgA,COVID-19_19_IgA,COVID-19_20_IgA,COVID-19_21_IgA,COVID-19_22_IgA,COVID-19_23_IgA,COVID-19_24_IgA,COVID-19_25_IgA,COVID-19_26_IgA,COVID-19_27_IgA,COVID-19_28_IgA,COVID-19_29_IgA,COVID-19_30_IgA,COVID-19_31_IgA,COVID-19_32_IgA,COVID-19_33_IgA,COVID-19_34_IgA,COVID-19_35_IgA,COVID-19_36_IgA,COVID-19_37_IgA,COVID-19_38_IgA,COVID-19_39_IgA,COVID-19_40_IgA,COVID-19_41_IgA,COVID-19_42_IgA,COVID-19_43_IgA,COVID-19_44_IgA,COVID-19_45_IgA,COVID-19_46_IgA,COVID-19_47_IgA,COVID-19_48_IgA,COVID-19_49_IgA,COVID-19_50_IgA,COVID-19_51_IgA,COVID-19_52_IgA,COVID-19_53_IgA,COVID-19_54_IgA,COVID-19_55_IgA,COVID-19_56_IgA,COVID-19_57_IgA,COVID-19_58_IgA,COVID-19_59_IgA,COVID-19_60_IgA,COVID-19_61_IgA,COVID-19_62_IgA,COVID-19_63_IgA,COVID-19_64_IgA,COVID-19_65_IgA,COVID-19_66_IgA,COVID-19_67_IgA,COVID-19_68_IgA,COVID-19_69_IgA,COVID-19_70_IgA,COVID-19_71_IgA,COVID-19_72_IgA,COVID-19_73_IgA,COVID-19_74_IgA,COVID-19_75_IgA,COVID-19_76_IgA,COVID-19_77_IgA,COVID-19_78_IgA,COVID-19_79_IgA,COVID-19_80_IgA,COVID-19_81_IgA,COVID-19_82_IgA,COVID-19_83_IgA,COVID-19_84_IgA,COVID-19_85_IgA,COVID-19_86_IgA,COVID-19_87_IgA,COVID-19_88_IgA,Normal_1_IgA,Normal_2_IgA,Normal_3_IgA,Normal_4_IgA,Normal_5_IgA,Normal_6_IgA,Normal_7_IgA,Normal_8_IgA,Normal_9_IgA,Normal_10_IgA,Normal_11_IgA,Normal_12_IgA,Normal_13_IgA,Normal_14_IgA,Normal_15_IgA,Normal_16_IgA,Normal_17_IgA,Normal_18_IgA,Normal_19_IgA,Normal_20_IgA,Normal_21_IgA,Normal_22_IgA,Normal_23_IgA,Normal_24_IgA,Normal_25_IgA,Normal_26_IgA
1,Microbial lysate,Viruses,Severe acute respiratory syndrome coronavirus 2 (SARS-CoV-2),-,0,0,0,0,0,0,0,0,0,0,0,0,0,0,0,0,0,0,0,0.498506281,0,0,0,0,0,1.367920352,2.495367635,0,0,0,0,0,0,0,0,0,0,0,0,0,0,0,0,0,0,0,0,0,0,0,0,0,0,0,0,0,0,0,0,0,0,0,0,0,0,0,0,0,0,0,0,0,0,0,0,0,0,0,0,0,0,0,0,0,0,0,0,0,0,0,0,0,0,0,0,0,0,0.632824661,0,0,0,0,0,0,0,0,0,0,0,0,0,0,0,0,0,0,0,0,0,2.660912801,0,0,0,0,0,0,0,0,0,0,0,0,0,0,0,1.934068233,0,0,0,0,0,0,0,0,0,0,0,0,0,0,0,0,0,0,0,0,0,0,0,0,0,0,0,0,0,0,0,0,0,0,0,0,0,0,0,0,0,0,0,0,0,0,0,0,0,0,0,0,0,0,0,0,0,0,0,0,0,0,0,0,0,0,0,0,0,0,0,0,0,0,0,0,0,0,0,0,0,0,0,0,0,0,0,0,0,0,0,0,0,0,0,0,0,0,0,0,0,0,0,0,0,0,0,0,0,0,0,0,-0.470661744,0,0,0,0,0.912639764,0.178176431,0,0.662850413,0,0,0,1.153697188,0,0,0,0,0,0,0,-0.133053085,0,0,0,0,0,0,0,0,0,0,0,0,0,0,0,0,0,0,0,0,0,0,0,0,0,0,0,0,0,0,0,0,0,0,1.645146558,0,0,0,0,1.18164353,0,0,0,0,0,0,0,0,0,0,0,0,0,0,0,0,0,0,0,0,0,0,0,0,0,0,0,0,0,0,0,0,0
2,Microbial lysate,Viruses,Severe acute respiratory syndrome coronavirus 2 (SARS-CoV-2),-,0,0,0,0,0,0,0,0,0,0,0,0,0,0,0,0,0,0,0,-0.003923709,0,0,0,0,0,0.538191905,1.678433736,0,0,0,0,0,0,0,0,0,0,0,0,0,0,0,0,0,0,0,0,0,0,0,0,0,0,0,0,0,0,0,0,0,0,0,0,0,0,0,0,0,0,0,0,0,0,0,0,0,0,0,0,0,0,0,0,0,0,0,0,0,0,0,0,0,0,0,0,0,0,0.810887221,0,0,0,0,0,0,0,0,0,0,0,0,0,0,0,0,0,0,0,0,0,1.667120603,0,0,0,0,0,0,0,0,0,0,0,0,0,0,0,1.373758624,0,0,0,0,0,0,0,0,0,0,0,0,0,0,0,0,0,0,0,0,0,0,0,0,0,0,0,0,0,0,0,0,0,0,0,0,0,0,0,0,0,0,0,0,0,0,0,0,0,0,0,0,0,0,0,0,0,0,0,0,0,0,0,0,0,0,0,0,0,0,0,0,0,0,0,0,0,0,0,0,0,0,0,0,0,0,0,0,0,0,0,0,0,0,0,0,0,0,0,0,0,0,0,0,0,0,0,0,0,0,0,0,0,0,0,0,0,0.94944879,0.002459285,0,0.454376752,0,0,0,1.453634132,0,0,0,0,0,0,0,-0.043607697,0,0,0,0,0,0,0,0,0,0,0,0,0,0,0,0,0,0,0,0,0,0,0,0,0,0,0,0,0,0,0,0,0,0,1.342539246,0,0,0,0,1.279342884,0,0,0,0,0,0,0,0,0,0,0,0,0,0,0,0,0,0,0,0,0,0,0,0,0,0,0,0,0,0,0,0,0
3,Recombinant microbial protein,Viruses,Severe acute respiratory syndrome coronavirus 2 (SARS-CoV-2),Nucleoprotein NP,0.816068348,0,0,0,0,1.199289507,0,2.096559626,0,0,1.833064292,0,0,0,0,0,0,3.09348306,0.462997035,0,0,0,0,0,0,0,0,0,0,0,0,0,0,0,0,0.423250097,0,0,0,0,0,0,0,0.448437557,0,-0.247008206,0,0.255479175,0,0,1.93945956,0,0,0,0,0,0,0,0,0,0,2.374185647,0,0,0,0,1.514090922,0,2.086177241,0,0,0,0,1.792241907,2.982899829,0,0,0,0,0,0,0,0,0,0,0,0,0,0,0,0,0,0,0,0,0,0,0,0,0,0,0,0,0,0,0,0,0,0,0,0,0,0,0,0,0,0,0,0,0,0,0,0,0,0,0,0,0,0,0,0,0,0,0,0,0,0,0,0,0,0,0,0,0,0,0,0,0,0,0,0,0,0,0,0,0,0,0,0,0,0,0,0,0,0,0,0,0,0,0,0,0,0,0,0,0,0,0,0,0,0,0,0,0,0,0,0,0,0,0,0,0,0,0,0,0,0,0,0,0,0,0,0,0,0,0,0,0,0,0,0,0,0,0,0,0,0,0,0,0,0,0,0,0,0,0,0,0,0,0,0,0,3.123078117,0,-1.34681132,0,0,0,0,0,0,0,0,0,0,0,0,0,0,0,0,0,0,3.078825233,0,0,0,0,0,0,0,0,0,0,0,0,0,0,0,0,0,0.93487312,0,0,0,0,0,0,0,0,0,0,0,0,0,0,0,0,0,0,0,0,0,0,0,0,0,0,0,0,0,0,0,0,0,0,0,0,0,0,0,0,0,0,0,0,0,0,0,0,0,0,0,0,0,0,0,0,0,0,0,0,0,0,0,0,0,0,0,0,0,0
4,Recombinant microbial protein,Viruses,Severe acute respiratory syndrome coronavirus 2 (SARS-CoV-2),Nucleoprotein NP,0,0,0,0,1.980159826,0,0,0,0,0,-0.157587389,0.233445797,0,0,0.156938409,0,0,1.689766793,1.109561313,0,0,0,-0.19972934,0,0,0,0,0,0,0,0,0,0,0,0,0,0,0,0,0,0,0,0,0,0,0,0,0,0.320358,-0.023967766,0,0,2.483373015,0,0,0,0,0,0,2.114822387,0,2.323395018,0,0,0,0,0,0,1.575811723,0,0.465562846,0,0,0,0,4.914156649,0,0,0,0,0,0,0,0,0,0,0,0,0,0,0,0,0,0,0,0,0,0,0,0,0,0,0,0,0,0,0,0,2.444142538,0,0,0,0,0,0,0,0,0,0,0,0,0,0,0,0,3.67305463,0,0,3.507889435,0,0,3.734769653,3.115198022,2.629374192,0,0,2.587819723,0,0,0,0,0,0,0,0,0,0,0,0,0,0,0,0,0,0,0,0,0,0,0,1.861721788,2.353325507,0,0,0,0,4.480139796,0,0,0,0,2.126593449,1.923580248,4.671625019,0,2.951655528,0,0,0,2.480355223,0,0,2.187727097,2.422431779,3.454950361,0,1.046336904,0,0,6.666847749,0,0,0,0,0,0,0,0,0,2.274052505,0,0,0,0,0,0,0,0,0,0,0,0,0,0,0,0,0,0,0,0,2.270215917,0,6.286600106,2.878175654,0,1.503272183,0,4.499806414,0,0,0,0,2.541534675,0,0,0,0,0,0,0,0,0,0,0,0,0.561903843,0,0,0,0,0,0,0,0,0,0,0,0,0,0,0,0,0,0,0,0,0,0,0,0,0,-0.033091205,0,0,0,0,0.440337185,0.354364992,0,0,0,0,0,0,0,0,0,0,0,0,0,0,0,0,0,0,0,0,0,0,0,0,0,0.703189176,0,0,0,0,0,0,0,0,0,0,0,0,0,0,0,0,0,0,0,0,0,0,0,0,0,0,0,0,0,0,0,0,0,0,0,0,0,0
5,Recombinant microbial protein,Viruses,Severe acute respiratory syndrome coronavirus 2 (SARS-CoV-2),Nucleoprotein NP,0,0,0,0,0,0.944152398,1.300065754,1.55843765,0,2.333774022,3.267961176,1.672363653,0,0,0.436103027,0,0,4.052276876,0.949253483,0,0,0,0,0,0,0,0,0,0,0,0,0,0,0,0,0.585764549,0,0,-0.15646442,1.185956707,0,0,0,1.385337338,0,-1.11276286,0,0.166518707,-0.02263824,0,0.884924325,0.831290925,1.041065574,0,0,0,0,2.675959135,0,2.065699191,0,3.633982475,0.17506392,0,0,0,2.186927575,0,1.91513094,2.241789138,0,0,1.450499785,3.328227281,4.579476187,0,0,1.301679624,0,0,0,1.046521597,0,0.890046017,0,0,0,0,0,0,0,0,0,0,0,0,0,0,0,0,0,0,0,0,0,0,0,0,0,0,0,0,0,0,0,0,0,0,0,0,0,0,0,0,0,0,0,0,0,0,0,0,0,0,0,0,0,0,0,0,0,0,0,0,0,0,0,0,0,0,0,0,0,0,0,0,0,0,0,0,0,0,0,0,0,0,0,0,0,0,0,2.759098443,0,0,0,0,0,0,0,0,0,0,0,0,0,0,2.197678468,0,0,0,0,0,0,0,0,0,0,0,0,0,0,0,0,0,0,0,0,0,0,0,0,0,0,0,0,0,0,0,0,0,0,0,0,0,0,0,0,0,0,0,0,0,4.254347587,0,1.119247284,0,0,0,0,0,0,0,0,0,0,0.613722733,0,0,0,0,0,0,0,0,0,0,0,0,0,0,0,0,0,0,0,0,0,0,0,0,0,1.227784237,0,0,0,0,0,0,0,0,0,0,0,0,0,0,0,0,0,1.832896408,0,0,0,0,0,0,0,0,0,0,0,0,0.794115117,0,0,0,0,0,0,0,0,0,0,0,0,0,0,0,0,0,0,0,0,0,0,0,0,0,0,0,0,0,0,0,0,0,0,0,0,0,0,0